Update ediText.cpp

3 jobs for master
Status Job ID Name Coverage
  Test
failed #5105
build_image

00:02:45

canceled #5104
build_image

canceled #5103
build_image

 
Name Stage Failure
failed
build_image Test
CMakeFiles/ediText.dir/build.make:62: recipe for target 'CMakeFiles/ediText.dir/ediText.cpp.o' failed
make[2]: *** [CMakeFiles/ediText.dir/ediText.cpp.o] Error 1
CMakeFiles/Makefile2:75: recipe for target 'CMakeFiles/ediText.dir/all' failed
make[1]: *** [CMakeFiles/ediText.dir/all] Error 2
Makefile:83: recipe for target 'all' failed
make: *** [all] Error 2
The command '/bin/sh -c mkdir editext/bin && cd editext/bin && cmake .. && make -j && cd .. && mkdir /home/worker && mv bin/ediText /home/worker/ediText && cd /home && rm -r /home/install' returned a non-zero code: 2
Cleaning up file based variables
ERROR: Job failed: exit code 2