Update .gitlab-ci.yml

1 job for sgjp in 1 minute and 23 seconds (queued for 1 second)
Status Job ID Name Coverage
  Build
failed #2229
build_image

00:01:23

 
Name Stage Failure
failed
build_image Build
  ^
make[2]: *** [CMakeFiles/morphodita.dir/morphoDita_service.cpp.o] Error 1
CMakeFiles/morphodita.dir/build.make:62: recipe for target 'CMakeFiles/morphodita.dir/morphoDita_service.cpp.o' failed
CMakeFiles/Makefile2:75: recipe for target 'CMakeFiles/morphodita.dir/all' failed
make[1]: *** [CMakeFiles/morphodita.dir/all] Error 2
Makefile:83: recipe for target 'all' failed
make: *** [all] Error 2
The command '/bin/sh -c cd src && git clone http://nlp.pwr.wroc.pl/g419-morphodita.git && cd g419-morphodita/src && make -j4 lib && cd ../.. && mkdir build && cd build && cmake .. && make -j4' returned a non-zero code: 2
ERROR: Job failed: exit code 2