Merge branch 'amqpcpp-dependency' into 'master'

Amqpcpp dependency

See merge request !3
1 job for master in 1 minute and 41 seconds (queued for 4 seconds)
Status Job ID Name Coverage
  Test
failed #5084
build_image

00:01:41

 
Name Stage Failure
failed
build_image Test
make[2]: *** [CMakeFiles/ediText.dir/ediText.cpp.o] Error 1
make[2]: *** Waiting for unfinished jobs....
CMakeFiles/Makefile2:75: recipe for target 'CMakeFiles/ediText.dir/all' failed
make[1]: *** [CMakeFiles/ediText.dir/all] Error 2
Makefile:83: recipe for target 'all' failed
make: *** [all] Error 2
The command '/bin/sh -c mkdir editext/bin && cd editext/bin && cmake .. && make -j && cd .. && mkdir /home/worker && mv bin/ediText /home/worker/ediText && cd /home && rm -r /home/install' returned a non-zero code: 2
Cleaning up file based variables
ERROR: Job failed: exit code 2